Target
Carbonic anhydrase 2
Ligand
BDBM50258998
Substrate
Meas. Tech.
ChEBML_1690988
IC50
0.338000±n/a nM
Citation
 Alt?ntop, MDSever, BAkal?nÇiftçi, GKucukoglu, KÖzdemir, ASoleimani, SSNadaroglu, HKaplanc?kl?, ZA Synthesis and evaluation of new benzodioxole-based dithiocarbamate derivatives as potential anticancer agents and hCA-I and hCA-II inhibitors. Eur J Med Chem 125:190-196 (2017)  
Target
Name:
Carbonic anhydrase 2
Synonyms:
CA-II CAC Carbonate dehydratase II Carbonic anhydrase 2 (CA-II) Carbonic anhydrase C Carbonic anhydrase II (CA-II) Carbonic anhydrase II (hCA II) | Carbonic anhydrase isoenzyme II (hCA II)
Type:
Enzyme
Mol. Mass.:
29250.71
Organism:
Homo sapiens (Human)
Description:
P00918
Residue:
260
  
Inhibitor
Name:
BDBM50258998
Synonyms:
CHEMBL4099344
Type:
Small organic molecule
Emp. Form.:
C15H19N3O3S3
Mol. Mass.:
385.525
SMILES:
O=C(CSC(=S)NN1CCSCC1)NCc1ccc2OCOc2c1
: