Target
Polyunsaturated fatty acid 5-lipoxygenase
Ligand
BDBM50008956
Substrate
Meas. Tech.
ChEBML_736
IC50
3600±n/a nM
Citation
 Flynn, DLBelliotti, TRBoctor, AMConnor, DTKostlan, CRNies, DEOrtwine, DFSchrier, DJSircar, JC Styrylpyrazoles, styrylisoxazoles, and styrylisothiazoles. Novel 5-lipoxygenase and cyclooxygenase inhibitors. J Med Chem 34:518-25 (1991)  
Target
Name:
Polyunsaturated fatty acid 5-lipoxygenase
Synonyms:
Alox5 LOX5_RAT
Type:
PROTEIN
Mol. Mass.:
78082.31
Organism:
Rattus norvegicus
Description:
ChEMBL_1432947
Residue:
673
  
Inhibitor
Name:
BDBM50008956
Synonyms:
2,6-Diisopropyl-4-[2-(5-methyl-1H-pyrazol-3-yl)-vinyl]-phenol | CHEMBL150804
Type:
Small organic molecule
Emp. Form.:
C18H24N2O
Mol. Mass.:
284.396
SMILES:
CC(C)c1cc(C=Cc2cc(C)n[nH]2)cc(C(C)C)c1O
: