Target
Polyunsaturated fatty acid 5-lipoxygenase
Ligand
BDBM50008943
Substrate
Meas. Tech.
ChEBML_736
IC50
20000±n/a nM
Citation
 Flynn, DLBelliotti, TRBoctor, AMConnor, DTKostlan, CRNies, DEOrtwine, DFSchrier, DJSircar, JC Styrylpyrazoles, styrylisoxazoles, and styrylisothiazoles. Novel 5-lipoxygenase and cyclooxygenase inhibitors. J Med Chem 34:518-25 (1991)  
Target
Name:
Polyunsaturated fatty acid 5-lipoxygenase
Synonyms:
Alox5 LOX5_RAT
Type:
PROTEIN
Mol. Mass.:
78082.31
Organism:
Rattus norvegicus
Description:
ChEMBL_1432947
Residue:
673
  
Inhibitor
Name:
BDBM50008943
Synonyms:
4-[2-(3-Methyl-isoxazol-5-yl)-vinyl]-phenol | CHEMBL356843
Type:
Small organic molecule
Emp. Form.:
C12H11NO2
Mol. Mass.:
201.2212
SMILES:
Cc1cc(\C=C\c2ccc(O)cc2)on1
: