Target
Polyunsaturated fatty acid 5-lipoxygenase
Ligand
BDBM50008962
Substrate
Meas. Tech.
ChEBML_736
IC50
1200±n/a nM
Citation
 Flynn, DLBelliotti, TRBoctor, AMConnor, DTKostlan, CRNies, DEOrtwine, DFSchrier, DJSircar, JC Styrylpyrazoles, styrylisoxazoles, and styrylisothiazoles. Novel 5-lipoxygenase and cyclooxygenase inhibitors. J Med Chem 34:518-25 (1991)  
Target
Name:
Polyunsaturated fatty acid 5-lipoxygenase
Synonyms:
Alox5 LOX5_RAT
Type:
PROTEIN
Mol. Mass.:
78082.31
Organism:
Rattus norvegicus
Description:
ChEMBL_1432947
Residue:
673
  
Inhibitor
Name:
BDBM50008962
Synonyms:
2-tert-Butyl-6-methoxy-4-[2-(5-methyl-isothiazol-3-yl)-vinyl]-phenol | CHEMBL148922
Type:
Small organic molecule
Emp. Form.:
C17H21NO2S
Mol. Mass.:
303.419
SMILES:
COc1cc(\C=C\c2cc(C)sn2)cc(c1O)C(C)(C)C
: