Target
Aurora kinase A
Ligand
BDBM50252727
Substrate
Meas. Tech.
ChEMBL_1691361 (CHEMBL4042010)
IC50
42±n/a nM
Citation
 Gaboriaud-Kolar, NMyrianthopoulos, VVougogiannopoulou, KGerolymatos, PHorne, DAJove, RMikros, ENam, SSkaltsounis, AL Natural-Based Indirubins Display Potent Cytotoxicity toward Wild-Type and T315I-Resistant Leukemia Cell Lines. J Nat Prod 79:2464-2471 (2016)  
Target
Name:
Aurora kinase A
Synonyms:
AIK ARK1 AURKA AYK1 Aurora kinase A (AURA) Aurora kinase A (Aurora A) Aurora-related kinase 1 BTAK Breast-tumor-amplified kinase STK15 Serine/threonine kinase 15 Serine/threonine-protein kinase aurora A hARK1
Type:
Serine/threonine-protein kinase
Mol. Mass.:
45830.98
Organism:
Homo sapiens (Human)
Description:
O14965
Residue:
403
  
Inhibitor
Name:
BDBM50252727
Synonyms:
(2'Z-3'E)-6-Bromoindirubin-3'-(O-{2-[N-methyl,N-(2,3-dihydroxypropyl)amino]ethyl}oxime] | CHEMBL494867
Type:
Small organic molecule
Emp. Form.:
C22H23BrN4O4
Mol. Mass.:
487.346
SMILES:
CN(CCO\N=C1\C(\Nc2ccccc\12)=C1\C(=O)Nc2cc(Br)ccc12)CC(O)CO
: