Target
Amine oxidase [flavin-containing] B
Ligand
BDBM50259595
Substrate
Meas. Tech.
ChEBML_1691442
IC50
0.900000±n/a nM
Citation
 Joubert, JFoka, GBRepsold, BPOliver, DWKapp, EMalan, SF Synthesis and evaluation of 7-substituted coumarin derivatives as multimodal monoamine oxidase-B and cholinesterase inhibitors for the treatment of Alzheimer's disease. Eur J Med Chem 125:853-864 (2017)  
Target
Name:
Amine oxidase [flavin-containing] B
Synonyms:
AOFB_HUMAN MAOB Monoamine oxidase type B (MAO B) Monoamine oxidase type B (MAOB)
Type:
Protein
Mol. Mass.:
58768.76
Organism:
Homo sapiens (Human)
Description:
P27338
Residue:
520
  
Inhibitor
Name:
BDBM50259595
Synonyms:
CHEMBL4097867
Type:
Small organic molecule
Emp. Form.:
C17H13BrO3
Mol. Mass.:
345.187
SMILES:
Cc1cc(=O)oc2cc(OCc3ccc(Br)cc3)ccc12
: