Target
Proteasome subunit beta type-5
Ligand
BDBM50259645
Substrate
Meas. Tech.
ChEBML_1691520
IC50
0.300000±n/a nM
Citation
 Han, LQYuan, XWu, XYLi, RDXu, BCheng, QLiu, ZMZhou, TYAn, HYWang, XCheng, TMGe, ZMCui, JRLi, RT Urea-containing peptide boronic acids as potent proteasome inhibitors. Eur J Med Chem 125:925-939 (2017)  
Target
Name:
Proteasome subunit beta type-5
Synonyms:
20S proteasome chymotrypsin-like LMPX PSB5_HUMAN Proteasome Macropain subunit MB1 X
Type:
Protein
Mol. Mass.:
28480.96
Organism:
Homo sapiens (Human)
Description:
Residue:
263
  
Inhibitor
Name:
BDBM50259645
Synonyms:
CHEMBL4070336
Type:
Small organic molecule
Emp. Form.:
C28H34BN3O4
Mol. Mass.:
487.398
SMILES:
CC(C)C[C@H](NC(=O)[C@H](Cc1ccccc1)NC(=O)NCc1cccc(c1)-c1ccccc1)B(O)O
: