Target
Proteasome subunit beta type-5
Ligand
BDBM50259647
Substrate
Meas. Tech.
ChEBML_1691520
IC50
2.0±n/a nM
Citation
 Han, LQYuan, XWu, XYLi, RDXu, BCheng, QLiu, ZMZhou, TYAn, HYWang, XCheng, TMGe, ZMCui, JRLi, RT Urea-containing peptide boronic acids as potent proteasome inhibitors. Eur J Med Chem 125:925-939 (2017)  
Target
Name:
Proteasome subunit beta type-5
Synonyms:
20S proteasome chymotrypsin-like LMPX PSB5_HUMAN Proteasome Macropain subunit MB1 X
Type:
Protein
Mol. Mass.:
28480.96
Organism:
Homo sapiens (Human)
Description:
Residue:
263
  
Inhibitor
Name:
BDBM50259647
Synonyms:
CHEMBL4100727
Type:
Small organic molecule
Emp. Form.:
C22H28BF2N3O4
Mol. Mass.:
447.283
SMILES:
CC(C)C[C@H](NC(=O)[C@H](Cc1ccccc1)NC(=O)NCc1ccc(F)c(F)c1)B(O)O
: