Target
Proteasome subunit beta type-1
Ligand
BDBM50259655
Substrate
Meas. Tech.
ChEBML_1691540
IC50
70±n/a nM
Citation
 Han, LQYuan, XWu, XYLi, RDXu, BCheng, QLiu, ZMZhou, TYAn, HYWang, XCheng, TMGe, ZMCui, JRLi, RT Urea-containing peptide boronic acids as potent proteasome inhibitors. Eur J Med Chem 125:925-939 (2017)  
Target
Name:
Proteasome subunit beta type-1
Synonyms:
PSB1_HUMAN PSMB1 Proteasome subunit beta type-1/beta type-5
Type:
PROTEIN
Mol. Mass.:
26493.62
Organism:
Homo sapiens (Human)
Description:
ChEMBL_1366691
Residue:
241
  
Inhibitor
Name:
BDBM50259655
Synonyms:
CHEMBL4080306
Type:
Small organic molecule
Emp. Form.:
C23H32BN3O4
Mol. Mass.:
425.329
SMILES:
CC(C)C[C@H](NC(=O)[C@H](Cc1ccccc1)NC(=O)N[C@H](C)c1ccccc1)B(O)O
: