Target
G-protein coupled receptor 35
Ligand
BDBM50436001
Substrate
Meas. Tech.
ChEMBL_1691963 (CHEMBL4042612)
EC50
12±n/a nM
Citation
 Wei, LWang, JZhang, XWang, PZhao, YLi, JHou, TQu, LShi, LLiang, XFang, Y Discovery of 2H-Chromen-2-one Derivatives as G Protein-Coupled Receptor-35 Agonists. J Med Chem 60:362-372 (2017)  
Target
Name:
G-protein coupled receptor 35
Synonyms:
G protein-coupled receptor 35 GPR35_HUMAN
Type:
Enzyme Catalytic Domain
Mol. Mass.:
34085.57
Organism:
Homo sapiens (Human)
Description:
gi_33695097
Residue:
309
  
Inhibitor
Name:
BDBM50436001
Synonyms:
CHEMBL2392174 | CHEMBL2425818
Type:
Small organic molecule
Emp. Form.:
C18H12BrNO6
Mol. Mass.:
418.195
SMILES:
COc1ccc(cc1)C(=O)Nc1cc(Br)cc2c1oc(cc2=O)C(O)=O
: