Target
G-protein coupled receptor 35
Ligand
BDBM50259879
Substrate
Meas. Tech.
ChEMBL_1691965 (CHEMBL4042614)
IC50
14130±n/a nM
Citation
 Wei, LWang, JZhang, XWang, PZhao, YLi, JHou, TQu, LShi, LLiang, XFang, Y Discovery of 2H-Chromen-2-one Derivatives as G Protein-Coupled Receptor-35 Agonists. J Med Chem 60:362-372 (2017)  
Target
Name:
G-protein coupled receptor 35
Synonyms:
G protein-coupled receptor 35 GPR35_HUMAN
Type:
Enzyme Catalytic Domain
Mol. Mass.:
34085.57
Organism:
Homo sapiens (Human)
Description:
gi_33695097
Residue:
309
  
Inhibitor
Name:
BDBM50259879
Synonyms:
CHEMBL4062531
Type:
Small organic molecule
Emp. Form.:
C11H7BrN4O3
Mol. Mass.:
323.102
SMILES:
COc1cc2oc(=O)c(cc2cc1Br)-c1nnn[nH]1
: