Target
Glucocorticoid receptor
Ligand
BDBM50259978
Substrate
Meas. Tech.
ChEMBL_1692241 (CHEMBL4042890)
IC50
5±n/a nM
Citation
 Berger, MRehwinkel, HSchmees, NSchäcke, HEdman, KWissler, LReichel, AJaroch, S Discovery of new selective glucocorticoid receptor agonist leads. Bioorg Med Chem Lett 27:437-442 (2017)  
Target
Name:
Glucocorticoid receptor
Synonyms:
GCR_HUMAN GRL Glucocorticoid receptor (GRFP) Nuclear receptor subfamily 3 group C member 1
Type:
Enzyme
Mol. Mass.:
85656.87
Organism:
Homo sapiens (Human)
Description:
P04150
Residue:
777
  
Inhibitor
Name:
BDBM50259978
Synonyms:
CHEMBL4069357
Type:
Small organic molecule
Emp. Form.:
C23H22F4N2O2
Mol. Mass.:
434.4266
SMILES:
CC[C@@H]1C[C@@](O)([C@@H](Nc2cccc3nc(C)ccc23)c2ccc(F)c(O)c12)C(F)(F)F
: