Target
Plasminogen
Ligand
BDBM50260045
Substrate
Meas. Tech.
ChEMBL_1692438 (CHEMBL4043328)
Kd
1000±n/a nM
Citation
 Afosah, DKAl-Horani, RASankaranarayanan, NVDesai, UR Potent, Selective, Allosteric Inhibition of Human Plasmin by Sulfated Non-Saccharide Glycosaminoglycan Mimetics. J Med Chem 60:641-657 (2017)  
Target
Name:
Plasminogen
Synonyms:
Activation peptide PLG Plasmin Plasmin heavy chain A, short form | Plasmin light chain B
Type:
Enzyme
Mol. Mass.:
90579.18
Organism:
Homo sapiens (Human)
Description:
Residue:
810
  
Inhibitor
Name:
BDBM50260045
Synonyms:
CHEMBL4103815
Type:
Small organic molecule
Emp. Form.:
C40H22Na8O38S8
Mol. Mass.:
1551.018
SMILES:
[Na+].[Na+].[Na+].[Na+].[Na+].[Na+].[Na+].[Na+].Cc1cc(COc2cc(OS([O-])(=O)=O)cc3oc(-c4ccc(OS([O-])(=O)=O)c(OS([O-])(=O)=O)c4)c(OS([O-])(=O)=O)c(=O)c23)c(C)cc1COc1cc(OS([O-])(=O)=O)cc2oc(-c3ccc(OS([O-])(=O)=O)c(OS([O-])(=O)=O)c3)c(OS([O-])(=O)=O)c(=O)c12
: