Target
Plasminogen
Ligand
BDBM50260046
Substrate
Meas. Tech.
ChEMBL_1692438 (CHEMBL4043328)
Kd
3600±n/a nM
Citation
 Afosah, DKAl-Horani, RASankaranarayanan, NVDesai, UR Potent, Selective, Allosteric Inhibition of Human Plasmin by Sulfated Non-Saccharide Glycosaminoglycan Mimetics. J Med Chem 60:641-657 (2017)  
Target
Name:
Plasminogen
Synonyms:
Activation peptide PLG Plasmin Plasmin heavy chain A, short form | Plasmin light chain B
Type:
Enzyme
Mol. Mass.:
90579.18
Organism:
Homo sapiens (Human)
Description:
Residue:
810
  
Inhibitor
Name:
BDBM50260046
Synonyms:
CHEMBL4060852
Type:
Small organic molecule
Emp. Form.:
C34H20Na4O22S4
Mol. Mass.:
1000.728
SMILES:
[Na+].[Na+].[Na+].[Na+].[O-]S(=O)(=O)Oc1ccc(cc1)-c1cc(=O)c2c(OC\C=C\COc3cc(OS([O-])(=O)=O)cc4oc(cc(=O)c34)-c3ccc(OS([O-])(=O)=O)cc3)cc(OS([O-])(=O)=O)cc2o1
: