Target
Bromodomain-containing protein 2
Ligand
BDBM50148603
Substrate
Meas. Tech.
ChEMBL_1692581 (CHEMBL4043471)
Kd
8600±n/a nM
Citation
 Liu, ZWang, PChen, HWold, EATian, BBrasier, ARZhou, J Drug Discovery Targeting Bromodomain-Containing Protein 4. J Med Chem 60:4533-4558 (2017)  
Target
Name:
Bromodomain-containing protein 2
Synonyms:
BRD2 Bromodomain and extra-terminal motif (BET) Bromodomain-containing protein 2 (BRD2) RING3
Type:
Protein
Mol. Mass.:
88085.95
Organism:
Homo sapiens (Human)
Description:
P25440
Residue:
801
  
Inhibitor
Name:
BDBM50148603
Synonyms:
CHEMBL3770724
Type:
Small organic molecule
Emp. Form.:
C17H21N3O2
Mol. Mass.:
299.3675
SMILES:
CC(=O)NCCCCn1c2CCNC(=O)c2c2ccccc12
: