Target
Bromodomain-containing protein 3
Ligand
BDBM50103503
Substrate
Meas. Tech.
ChEBML_1692579
Kd
4065±n/a nM
Citation
 Liu, ZWang, PChen, HWold, EATian, BBrasier, ARZhou, J Drug Discovery Targeting Bromodomain-Containing Protein 4. J Med Chem 60:4533-4558 (2017)  
Target
Name:
Bromodomain-containing protein 3
Synonyms:
BRD3 Bromodomain and extra-terminal motif (BET) Bromodomain-containing protein 3 (BRD3) RING3-like protein | RING3L
Type:
Protein
Mol. Mass.:
79571.81
Organism:
Homo sapiens (Human)
Description:
Q15059
Residue:
726
  
Inhibitor
Name:
BDBM50103503
Synonyms:
CHEMBL2393130 | US11117865, Compound RVX-208
Type:
Small organic molecule
Emp. Form.:
C20H22N2O5
Mol. Mass.:
370.3991
SMILES:
COc1cc(OC)c2c(c1)nc([nH]c2=O)-c1cc(C)c(OCCO)c(C)c1
: