Target
3-hydroxy-3-methylglutaryl-coenzyme A reductase
Ligand
BDBM50009410
Substrate
Meas. Tech.
ChEBML_80666
IC50
370±n/a nM
Citation
 Lee, TJHoltz, WJSmith, RLAlberts, AWGilfillan, JL 3-Hydroxy-3-methylglutaryl-coenzyme A reductase inhibitors. 8. Side chain ether analogues of lovastatin. J Med Chem 34:2474-7 (1991)  
Target
Name:
3-hydroxy-3-methylglutaryl-coenzyme A reductase
Synonyms:
HMDH_RAT Hmgcr
Type:
Enzyme
Mol. Mass.:
96689.85
Organism:
Rattus norvegicus (rat)
Description:
Isolated rat liver microsomes were used as enzyme source.
Residue:
887
  
Inhibitor
Name:
BDBM50009410
Synonyms:
6-[2-(8-Allyloxy-2,6-dimethyl-1,2,6,7,8,8a-hexahydro-naphthalen-1-yl)-ethyl]-4-hydroxy-tetrahydro-pyran-2-one | CHEMBL310877
Type:
Small organic molecule
Emp. Form.:
C22H32O4
Mol. Mass.:
360.4871
SMILES:
C[C@@H]1C[C@H](OCC=C)[C@@H]2[C@@H](CCC3C[C@@H](O)CC(=O)O3)[C@@H](C)C=CC2=C1
: