Target
3-hydroxy-3-methylglutaryl-coenzyme A reductase
Ligand
BDBM50009412
Substrate
Meas. Tech.
ChEBML_80666
IC50
2810±n/a nM
Citation
 Lee, TJHoltz, WJSmith, RLAlberts, AWGilfillan, JL 3-Hydroxy-3-methylglutaryl-coenzyme A reductase inhibitors. 8. Side chain ether analogues of lovastatin. J Med Chem 34:2474-7 (1991)  
Target
Name:
3-hydroxy-3-methylglutaryl-coenzyme A reductase
Synonyms:
HMDH_RAT Hmgcr
Type:
Enzyme
Mol. Mass.:
96689.85
Organism:
Rattus norvegicus (rat)
Description:
Isolated rat liver microsomes were used as enzyme source.
Residue:
887
  
Inhibitor
Name:
BDBM50009412
Synonyms:
4-Hydroxy-6-[2-(8-methoxy-2,6-dimethyl-1,2,6,7,8,8a-hexahydro-naphthalen-1-yl)-ethyl]-tetrahydro-pyran-2-one | CHEMBL81138
Type:
Small organic molecule
Emp. Form.:
C20H30O4
Mol. Mass.:
334.4498
SMILES:
CO[C@H]1C[C@@H](C)C=C2C=C[C@H](C)[C@H](CCC3C[C@@H](O)CC(=O)O3)[C@@H]12
: