Target
Beta-adrenergic receptor kinase 1
Ligand
BDBM50257350
Substrate
Meas. Tech.
ChEBML_1692743
IC50
30±n/a nM
Citation
 Waldschmidt, HVHoman, KTCato, MCCruz-Rodríguez, OCannavo, AWilson, MWSong, JCheung, JYKoch, WJTesmer, JJLarsen, SD Structure-Based Design of Highly Selective and Potent G Protein-Coupled Receptor Kinase 2 Inhibitors Based on Paroxetine. J Med Chem 60:3052-3069 (2017)  
Target
Name:
Beta-adrenergic receptor kinase 1
Synonyms:
ADRBK1 BARK Beta-ARK-1 G-protein coupled receptor kinase 2 GRK2
Type:
Enzyme
Mol. Mass.:
79581.30
Organism:
Homo sapiens (Human)
Description:
P25098
Residue:
689
  
Inhibitor
Name:
BDBM50257350
Synonyms:
CHEMBL1738877
Type:
Small organic molecule
Emp. Form.:
C24H21F3N6O
Mol. Mass.:
466.4583
SMILES:
Cn1c(CNc2cccc(c2)C(=O)NCc2ccccc2C(F)(F)F)nnc1-c1ccncc1
: