Target
Beta-adrenergic receptor kinase 1
Ligand
BDBM50260154
Substrate
Meas. Tech.
ChEMBL_1692744 (CHEMBL4043634)
IC50
2100±n/a nM
Citation
 Waldschmidt, HVHoman, KTCato, MCCruz-Rodríguez, OCannavo, AWilson, MWSong, JCheung, JYKoch, WJTesmer, JJLarsen, SD Structure-Based Design of Highly Selective and Potent G Protein-Coupled Receptor Kinase 2 Inhibitors Based on Paroxetine. J Med Chem 60:3052-3069 (2017)  
Target
Name:
Beta-adrenergic receptor kinase 1
Synonyms:
ADRBK1 Beta-ARK-1 G-protein-coupled receptor kinase 2 | GRK2
Type:
PROTEIN
Mol. Mass.:
79654.58
Organism:
Bos taurus
Description:
ChEMBL_113511
Residue:
689
  
Inhibitor
Name:
BDBM50260154
Synonyms:
CHEMBL4077133
Type:
Small organic molecule
Emp. Form.:
C21H23FN2O4
Mol. Mass.:
386.4167
SMILES:
CNC(=O)c1cc(ccc1F)[C@@H]1CCNC[C@H]1COc1ccc2OCOc2c1
: