Target
Renin
Ligand
BDBM50003187
Substrate
Meas. Tech.
ChEBML_195978
pH
7.4±n/a
IC50
590.0±n/a nM
Comments
extracted
Citation
 Weber, AEHalgren, TADoyle, JJLynch, RJSiegl, PKParsons, WHGreenlee, WJPatchett, AA Design and synthesis of P2-P1'-linked macrocyclic human renin inhibitors. J Med Chem 34:2692-701 (1991)  
Target
Name:
Renin
Synonyms:
Angiotensinogenase RENI_HUMAN
Type:
Enzyme
Mol. Mass.:
45058.99
Organism:
Homo sapiens (Human)
Description:
Residue:
406
  
Inhibitor
Name:
BDBM50003187
Synonyms:
CHEMBL92538 | [1-(4-Cyclohexylmethyl-3-hydroxy-2,6,10-trioxo-1-oxa-5,9-diaza-cyclotetradec-7-ylcarbamoyl)-2-phenyl-ethyl]-carbamic acid tert-butyl ester
Type:
Small organic molecule
Emp. Form.:
C32H48N4O8
Mol. Mass.:
616.7455
SMILES:
CC(C)(C)OC(=O)N[C@@H](Cc1ccccc1)C(=O)N[C@H]1CNC(=O)CCCCOC(=O)[C@H](O)[C@H](CC2CCCCC2)NC1=O
: