Target
Aldo-keto reductase family 1 member B1
Ligand
BDBM50009748
Substrate
Meas. Tech.
ChEBML_157078
IC50
110±n/a nM
Citation
 Mylari, BLLarson, ERBeyer, TAZembrowski, WJAldinger, CEDee, MFSiegel, TWSingleton, DH Novel, potent aldose reductase inhibitors: 3,4-dihydro-4-oxo-3-[[5-(trifluoromethyl)-2-benzothiazolyl] methyl]-1-phthalazineacetic acid (zopolrestat) and congeners. J Med Chem 34:108-22 (1991)  
Target
Name:
Aldo-keto reductase family 1 member B1
Synonyms:
AKR1B1 ALDR_HUMAN AR Aldose Reductase (ALR2) Aldose reductase (AR)
Type:
Protein
Mol. Mass.:
35855.50
Organism:
Homo sapiens (Human)
Description:
P15121. 4LAU; 2IKI; 4LB4; 2FZD; 2FZ8; 1US0
Residue:
316
  
Inhibitor
Name:
BDBM50009748
Synonyms:
CHEMBL20253 | [3-(5-Chloro-6-fluoro-benzothiazol-2-ylmethyl)-4-oxo-3,4-dihydro-phthalazin-1-yl]-acetic acid
Type:
Small organic molecule
Emp. Form.:
C18H11ClFN3O3S
Mol. Mass.:
403.815
SMILES:
OC(=O)Cc1nn(Cc2nc3cc(Cl)c(F)cc3s2)c(=O)c2ccccc12
: