Target
Renin
Ligand
BDBM50009917
Substrate
Meas. Tech.
ChEBML_192728
IC50
47±n/a nM
Citation
 Doherty, AMKaltenbronn, JSHudspeth, JPRepine, JTRoark, WHSircar, ITinney, FJConnolly, CJHodges, JCTaylor, MD New inhibitors of human renin that contain novel replacements at the P2 site. J Med Chem 34:1258-71 (1991)  
Target
Name:
Renin
Synonyms:
Angiotensinogenase RENI_HUMAN
Type:
Enzyme
Mol. Mass.:
45058.99
Organism:
Homo sapiens (Human)
Description:
Residue:
406
  
Inhibitor
Name:
BDBM50009917
Synonyms:
6-(3-Methyl-thioureido)-2-(3-naphthalen-1-yl-2-naphthalen-1-ylmethyl-propionylamino)-hexanoic acid [1-cyclohexylmethyl-2-hydroxy-3-(2-methyl-butylcarbamoyl)-propyl]-amide | CHEMBL22505
Type:
Small organic molecule
Emp. Form.:
C48H65N5O4S
Mol. Mass.:
808.126
SMILES:
CCC(C)CNC(=O)C[C@H](O)C(CC1CCCCC1)NC(=O)C(CCCCNC(=S)NC)NC(=O)C(Cc1cccc2ccccc12)Cc1cccc2ccccc12
: