Target
Coagulation factor XI
Ligand
BDBM50260646
Substrate
Meas. Tech.
ChEBML_1694491
Ki
0.020000±n/a nM
Citation
 Wang, CCorte, JRRossi, KABozarth, JMWu, YSheriff, SMyers, JELuettgen, JMSeiffert, DAWexler, RRQuan, ML Macrocyclic factor XIa inhibitors. Bioorg Med Chem Lett 27:4056-4060 (2017)  
Target
Name:
Coagulation factor XI
Synonyms:
Coagulation factor XIa Coagulation factor XIa light chain FA11_HUMAN Factor XIa PTA | Plasma thromboplastin antecedent
Type:
Enzyme
Mol. Mass.:
70130.58
Organism:
Homo sapiens (Human)
Description:
P03951
Residue:
625
  
Inhibitor
Name:
BDBM50260646
Synonyms:
CHEMBL4096251
Type:
Small organic molecule
Emp. Form.:
C31H26ClFN10O4
Mol. Mass.:
657.054
SMILES:
COC(=O)Nc1ccc2-c3c[nH]c(n3)[C@H](Cc3ccc(F)c(CCC(=O)Nc2c1)n3)NC(=O)\C=C\c1cc(Cl)ccc1-n1cnnn1
: