Target
Integrin alpha-IIb/beta-3
Ligand
BDBM50010167
Substrate
Meas. Tech.
ChEMBL_70334 (CHEMBL678839)
Ki
14500±n/a nM
Citation
 Samanen, JAli, FRomoff, TCalvo, RSorenson, EVasko, JStorer, BBerry, DBennett, DStrohsacker, M Development of a small RGD peptide fibrinogen receptor antagonist with potent antiaggregatory activity in vitro. J Med Chem 34:3114-25 (1991)  
Target
Name:
Integrin alpha-IIb/beta-3
Synonyms:
Glycoprotein IIb/IIIa
Type:
Mol. Mass.:
Description:
ASSAY_ID of EBI is 30109
Components:
This complex has 2 components.
Component 1
Name:
Integrin beta-3
Synonyms:
CD_antigen=CD61 GPIIIa ITGB3 Platelet membrane glycoprotein IIIa
Type:
Protein
Mol. Mass.:
87038.91
Organism:
Homo sapiens (Human)
Description:
P05106
Residue:
788
  
Component 2
Name:
Integrin alpha-IIb
Synonyms:
CD_antigen=CD41 GPIIb Glycoprotein IIb ITGA2B Integrin alpha-IIb heavy chain Integrin alpha-IIb light chain, form 2 Integrin alpha-V/beta-3 and alpha-IIb/beta 3 | Platelet membrane glycoprotein IIb
Type:
Protein
Mol. Mass.:
113354.85
Organism:
Homo sapiens (Human)
Description:
P08514
Residue:
1039
  
Inhibitor
Name:
BDBM50010167
Synonyms:
1N-[1-[5-amino-1-formyl-(1S)-pentylcarbamoyl]-(1S)-ethylcarbamoylmethylcarbamoylmethyl]-2-[2-(1H-5-imidazolyl)-1-[2-(1H-5-imidazolyl)-1-methylcarboxamido-(1S)-ethylcarboxamido]-(1S)-ethylcarboxamido]-4-methyl-(2S)-pentanamide 2-[1-[1-[1-amino-3-carbamoyl-(1S)-propylcarboxamido]-(1S)-ethylcarboxamidomethylcarboxamido]-2-carboxy-(1S)-ethylcarboxamido]-3-methyl-(2S)-butanoic acid | CHEMBL408419
Type:
Small organic molecule
Emp. Form.:
C52H82N18O17
Mol. Mass.:
1231.3179
SMILES:
CC(C)C[C@H](NC(=O)[C@H](Cc1cnc[nH]1)NC(=O)[C@H](Cc1cnc[nH]1)NC(C)=O)C(=O)NCC(=O)NCC(=O)N[C@@H](C)C(=O)N[C@@H](CCCCN)C(=O)N[C@@H](CCC(N)=O)C(=O)N[C@@H](C)C(=O)NCC(=O)N[C@@H](CC(O)=O)C(=O)N[C@@H](C(C)C)C(O)=O
: