Target
Non-receptor tyrosine-protein kinase TYK2
Ligand
BDBM50261215
Substrate
Meas. Tech.
ChEMBL_1695702 (CHEMBL4046592)
EC50
1200±n/a nM
Citation
 Liang, JVan Abbema, ABalazs, MBarrett, KBerezhkovsky, LBlair, WSChang, CDelarosa, DDeVoss, JDriscoll, JEigenbrot, CGoodacre, SGhilardi, NMacLeod, CJohnson, ABir Kohli, PLai, YLin, ZMantik, PMenghrajani, KNguyen, HPeng, ISambrone, AShia, SSmith, JSohn, STsui, VUltsch, MWilliams, KWu, LCYang, WZhang, BMagnuson, S Identification of an imidazopyridine scaffold to generate potent and selective TYK2 inhibitors that demonstrate activity in an in vivo psoriasis model. Bioorg Med Chem Lett 27:4370-4376 (2017)  
Target
Name:
Non-receptor tyrosine-protein kinase TYK2
Synonyms:
Non-receptor tyrosine-protein kinase TYK2 (TYK2) TYK2_HUMAN | Tyrosine-protein kinase TYK2
Type:
Protein
Mol. Mass.:
133666.03
Organism:
Homo sapiens (Human)
Description:
P29597
Residue:
1187
  
Inhibitor
Name:
BDBM50261215
Synonyms:
CHEMBL2387223
Type:
Small organic molecule
Emp. Form.:
C17H11ClF2N4O2
Mol. Mass.:
376.745
SMILES:
F[C@@H]1C[C@@H]1C(=O)Nc1cc(NC(=O)c2c(F)cc(cc2Cl)C#N)ccn1
: