Target
Non-receptor tyrosine-protein kinase TYK2
Ligand
BDBM50261256
Substrate
Meas. Tech.
ChEMBL_1695702 (CHEMBL4046592)
EC50
44±n/a nM
Citation
 Liang, JVan Abbema, ABalazs, MBarrett, KBerezhkovsky, LBlair, WSChang, CDelarosa, DDeVoss, JDriscoll, JEigenbrot, CGoodacre, SGhilardi, NMacLeod, CJohnson, ABir Kohli, PLai, YLin, ZMantik, PMenghrajani, KNguyen, HPeng, ISambrone, AShia, SSmith, JSohn, STsui, VUltsch, MWilliams, KWu, LCYang, WZhang, BMagnuson, S Identification of an imidazopyridine scaffold to generate potent and selective TYK2 inhibitors that demonstrate activity in an in vivo psoriasis model. Bioorg Med Chem Lett 27:4370-4376 (2017)  
Target
Name:
Non-receptor tyrosine-protein kinase TYK2
Synonyms:
Non-receptor tyrosine-protein kinase TYK2 (TYK2) TYK2_HUMAN | Tyrosine-protein kinase TYK2
Type:
Protein
Mol. Mass.:
133666.03
Organism:
Homo sapiens (Human)
Description:
P29597
Residue:
1187
  
Inhibitor
Name:
BDBM50261256
Synonyms:
CHEMBL4071399
Type:
Small organic molecule
Emp. Form.:
C17H13Cl2N7
Mol. Mass.:
386.238
SMILES:
CNc1cc(Nc2nccc3nc([nH]c23)-c2c(Cl)cccc2Cl)ncn1
: