Target
Solute carrier family 2, facilitated glucose transporter member 1
Ligand
BDBM50010263
Substrate
Meas. Tech.
ChEMBL_71572 (CHEMBL684233)
Kd
300±n/a nM
Citation
 Robbins, JDLaurenza, AKosley, RWO'Malley, GJSpahl, BSeamon, KB (Aminoalkyl)carbamates of forskolin: intermediates for the synthesis of functionalized derivatives of forskolin with different specificities for adenylyl cyclase and the glucose transporter. J Med Chem 34:3204-12 (1991)  
Target
Name:
Solute carrier family 2, facilitated glucose transporter member 1
Synonyms:
GLUT-1 GTR1_HUMAN Glucose transporter HepG2 glucose transporter | SLC2A1
Type:
Protein
Mol. Mass.:
54091.71
Organism:
Homo sapiens (Human)
Description:
Residue:
492
  
Inhibitor
Name:
BDBM50010263
Synonyms:
Acetic acid 10,10b-dihydroxy-6-(2-isothiocyanato-ethylcarbamoyloxy)-3,4a,7,7,10a-pentamethyl-1-oxo-3-vinyl-dodecahydro-benzo[f]chromen-5-yl ester | CHEMBL107985
Type:
Small organic molecule
Emp. Form.:
C26H38N2O8S
Mol. Mass.:
538.654
SMILES:
CC(=O)O[C@H]1[C@@H](OC(=O)NCCN=C=S)[C@H]2C(C)(C)CC[C@H](O)[C@]2(C)[C@@]2(O)C(=O)C[C@@](C)(O[C@]12C)C=C
: