Target
Adenylate cyclase type 1
Ligand
BDBM50010267
Substrate
Meas. Tech.
ChEBML_31291
Kd
236±n/a nM
Citation
 Robbins, JDLaurenza, AKosley, RWO'Malley, GJSpahl, BSeamon, KB (Aminoalkyl)carbamates of forskolin: intermediates for the synthesis of functionalized derivatives of forskolin with different specificities for adenylyl cyclase and the glucose transporter. J Med Chem 34:3204-12 (1991)  
Target
Name:
Adenylate cyclase type 1
Synonyms:
ADCY1 Adenylate cyclase type I
Type:
PROTEIN
Mol. Mass.:
124005.57
Organism:
Bos taurus
Description:
ChEMBL_31291
Residue:
1134
  
Inhibitor
Name:
BDBM50010267
Synonyms:
CHEMBL92719 [2-(4-Hydroxy-phenyl)-ethyl]-carbamic acid 5,10,10b-trihydroxy-3,4a,7,7,10a-pentamethyl-1-oxo-3-vinyl-dodecahydro-benzo[f]chromen-6-yl ester
Type:
Small organic molecule
Emp. Form.:
C29H41NO8
Mol. Mass.:
531.6377
SMILES:
CC1(C)CC[C@H](O)[C@@]2(C)[C@H]1[C@H](OC(=O)NCCc1ccc(O)cc1)[C@H](O)[C@@]1(C)O[C@](C)(CC(=O)[C@]21O)C=C
: