Target
Beta-galactosidase
Ligand
BDBM50140061
Substrate
Meas. Tech.
ChEMBL_1696005 (CHEMBL4046895)
IC50
850±n/a nM
Citation
 Pickens, JBWang, FStriegler, S Picomolar inhibition of?-galactosidase (bovine liver) attributed to loop closure. Bioorg Med Chem 25:5194-5202 (2017)  
Target
Name:
Beta-galactosidase
Synonyms:
β-galactosidase Beta-galactosidase/Glucosylceramidase | GLB1
Type:
Protein
Mol. Mass.:
73420.88
Organism:
Bos taurus (Bovine)
Description:
Residue:
653
  
Inhibitor
Name:
BDBM50140061
Synonyms:
CHEMBL3752112
Type:
Small organic molecule
Emp. Form.:
C14H20N2O3
Mol. Mass.:
264.3202
SMILES:
Cc1ccc(CNC2=N[C@H](CO)[C@H](O)[C@H](O)C2)cc1
: