Target
Beta-galactosidase
Ligand
BDBM50261444
Substrate
Meas. Tech.
ChEMBL_1696005 (CHEMBL4046895)
IC50
118±n/a nM
Citation
 Pickens, JBWang, FStriegler, S Picomolar inhibition of?-galactosidase (bovine liver) attributed to loop closure. Bioorg Med Chem 25:5194-5202 (2017)  
Target
Name:
Beta-galactosidase
Synonyms:
β-galactosidase Beta-galactosidase/Glucosylceramidase | GLB1
Type:
Protein
Mol. Mass.:
73420.88
Organism:
Bos taurus (Bovine)
Description:
Residue:
653
  
Inhibitor
Name:
BDBM50261444
Synonyms:
CHEMBL3359670
Type:
Small organic molecule
Emp. Form.:
C14H20N2O4
Mol. Mass.:
280.3196
SMILES:
Cc1ccccc1C\N=C1/N[C@H](CO)[C@H](O)[C@H](O)[C@H]1O
: