Target
5-hydroxytryptamine receptor 2A
Ligand
BDBM50130293
Substrate
Meas. Tech.
ChEBML_1696089
Ki
3.6±n/a nM
Citation
 Männel, BHübner, HMöller, DGmeiner, P ?-Arrestin biased dopamine D2 receptor partial agonists: Synthesis and pharmacological evaluation. Bioorg Med Chem 25:5613-5628 (2017)  
Target
Name:
5-hydroxytryptamine receptor 2A
Synonyms:
5-HT-2 5-HT2A 5-hydroxytryptamine receptor 2A (5HT-2A) 5HT2A_HUMAN HTR2A | Serotonin receptor 2A
Type:
undefined
Mol. Mass.:
52607.65
Organism:
Homo sapiens (Human)
Description:
P28223
Residue:
471
  
Inhibitor
Name:
BDBM50130293
Synonyms:
7-{4-[4-(2,3-dichlorophenyl)piperazin-1-yl]butoxy}-3,4-dihydroquinolin-2(1H)-one CHEMBL1112 US10752588, Compound Aripiprazole US9018213, aripprazole | US9156822, Aripiprazole
Type:
Small organic molecule
Emp. Form.:
C23H27Cl2N3O2
Mol. Mass.:
448.385
SMILES:
Clc1cccc(N2CCN(CCCCOc3ccc4CCC(=O)Nc4c3)CC2)c1Cl
: