Target
Carbonic anhydrase 9
Ligand
BDBM50261599
Substrate
Meas. Tech.
ChEBML_1696166
Ki
2.0±n/a nM
Citation
 Angapelly, SRamya, PVSAngeli, ADel Prete, SCapasso, CArifuddin, MSupuran, CT Development of sulfonamides incorporating phenylacrylamido functionalities as carbonic anhydrase isoforms I, II, IX and XII inhibitors. Bioorg Med Chem 25:5726-5732 (2017)  
Target
Name:
Carbonic anhydrase 9
Synonyms:
CA-IX CAH9_HUMAN Carbonic anhydrase 9 (CA IX) Carbonic anhydrase 9 precursor Carbonic anhydrase IX (CAIX) Carbonic anhydrases; II & IX MN RCC-associated antigen G250
Type:
Enzyme
Mol. Mass.:
49669.03
Organism:
Homo sapiens (Human)
Description:
Catalytic domain of human cloned isozyme was used in the assay
Residue:
459
  
Inhibitor
Name:
BDBM50261599
Synonyms:
CHEMBL4100697
Type:
Small organic molecule
Emp. Form.:
C15H13FN2O3S
Mol. Mass.:
320.339
SMILES:
NS(=O)(=O)c1ccc(NC(=O)\C=C\c2cccc(F)c2)cc1
: