Target
Beta-2 adrenergic receptor
Ligand
BDBM50010562
Substrate
Meas. Tech.
ChEBML_196404
Ki
390±n/a nM
Citation
 Leftheris, KGoodman, M Synthesis and beta-adrenergic antagonist activity of stereoisomeric practolol and propranolol derivatives. J Med Chem 33:216-23 (1990)  
Target
Name:
Beta-2 adrenergic receptor
Synonyms:
ADRB2_MOUSE Adrb2r Beta-2 adrenoceptor Beta-adrenergic receptor
Type:
PROTEIN
Mol. Mass.:
47002.38
Organism:
Mus musculus
Description:
ChEMBL_196404
Residue:
418
  
Inhibitor
Name:
BDBM50010562
Synonyms:
6-[3-(4-Acetylamino-phenoxy)-2-hydroxy-propylamino]-heptanoic acid (4-trifluoromethyl-phenyl)-amide | CHEMBL70217
Type:
Small organic molecule
Emp. Form.:
C25H32F3N3O4
Mol. Mass.:
495.5345
SMILES:
CC(CCCCC(=O)Nc1ccc(cc1)C(F)(F)F)NCC(O)COc1ccc(NC(C)=O)cc1
: