Target
Extracellular calcium-sensing receptor
Ligand
BDBM50261675
Substrate
Meas. Tech.
ChEBML_1696272
EC50
13±n/a nM
Citation
 Sparks, SMSpearing, PKDiaz, CJCowan, DJJayawickreme, CChen, GRimele, TJGeneraux, CHarston, LTRoller, SG Identification of potent, nonabsorbable agonists of the calcium-sensing receptor for GI-specific administration. Bioorg Med Chem Lett 27:4673-4677 (2017)  
Target
Name:
Extracellular calcium-sensing receptor
Synonyms:
CASR CaR Calcium-sensing receptor (CaSR) GPRC2A Parathyroid Cell calcium-sensing receptor Synonyms=GPRC2A | hCasR
Type:
Protein
Mol. Mass.:
120663.13
Organism:
Homo sapiens (Human)
Description:
P41180
Residue:
1078
  
Inhibitor
Name:
BDBM50261675
Synonyms:
CHEMBL4060025
Type:
Small organic molecule
Emp. Form.:
C25H30N4O
Mol. Mass.:
402.5319
SMILES:
C[C@@H](N[C@H]1CCN(C1)c1ccc(cc1)C(=O)NCCN)c1cccc2ccccc12
: