Target
D(2) dopamine receptor
Ligand
BDBM50010596
Substrate
Meas. Tech.
ChEBML_58691
IC50
>10000±n/a nM
Citation
 Davis, DAde Paulis, TJanowsky, ASmith, HE Chloro-substituted, sterically hindered 5,11-dicarbo analogues of clozapine as potential chiral antipsychotic agents. J Med Chem 33:809-14 (1990)  
Target
Name:
D(2) dopamine receptor
Synonyms:
DOPAMINE D2 DOPAMINE D2 Short Dopamine D2 receptor Drd2
Type:
G Protein-Coupled Receptor (GPCR)
Mol. Mass.:
50931.60
Organism:
Rattus norvegicus (rat)
Description:
P61169
Residue:
444
  
Inhibitor
Name:
BDBM50010596
Synonyms:
1-(8-Chloro-5-isopropylidene-5H-dibenzo[a,d]cyclohepten-10-yl)-4-methyl-piperazine | CHEMBL73082
Type:
Small organic molecule
Emp. Form.:
C23H25ClN2
Mol. Mass.:
364.911
SMILES:
[#6]-[#7]-1-[#6]-[#6]-[#7](-[#6]-[#6]-1)-[#6]-1=[#6]-c2ccccc2\[#6](=[#6](\[#6])-[#6])-c2ccc(Cl)cc-12
: