Target
D(1A) dopamine receptor
Ligand
BDBM52987
Substrate
Meas. Tech.
ChEBML_58644
Ki
915±n/a nM
Citation
 Gao, YGBaldessarini, RJKula, NSNeumeyer, JL Synthesis and dopamine receptor affinities of enantiomers of 2-substituted apomorphines and their N-n-propyl analogues. J Med Chem 33:1800-5 (1990)  
Target
Name:
D(1A) dopamine receptor
Synonyms:
DOPAMINE D1 Dopamine D1 high Dopamine receptor Dopamine1-like Drd1a
Type:
Enzyme Catalytic Domain
Mol. Mass.:
49429.75
Organism:
RAT
Description:
P18901
Residue:
446
  
Inhibitor
Name:
BDBM52987
Synonyms:
(6aR)-6-propyl-5,6,6a,7-tetrahydro-4H-dibenzo[de,g]quinoline-2,10,11-triol;hydrate;hydrobromide CHEMBL288096 R( )-2,10,11-Trihydroxy-N-propyl-noraporphine hydrobromide hydrate cid_23640911
Type:
Small organic molecule
Emp. Form.:
C19H21NO3
Mol. Mass.:
311.3749
SMILES:
CCCN1CCc2cc(O)cc-3c2[C@H]1Cc1ccc(O)c(O)c-31
: