Target
D(2) dopamine receptor
Ligand
BDBM50010724
Substrate
Meas. Tech.
ChEBML_61757
IC50
8.8±n/a nM
Citation
 Högberg, Tde Paulis, TJohansson, LKumar, YHall, HOgren, SO Potential antipsychotic agents. 7. Synthesis and antidopaminergic properties of the atypical highly potent (S)-5-bromo-2,3-dimethoxy-N-[(1-ethyl-2-pyrrolidinyl)methyl]benzamide and related compounds. A comparative study. J Med Chem 33:2305-9 (1990)  
Target
Name:
D(2) dopamine receptor
Synonyms:
DOPAMINE D2 DOPAMINE D2 Short Dopamine D2 receptor Drd2
Type:
G Protein-Coupled Receptor (GPCR)
Mol. Mass.:
50931.60
Organism:
Rattus norvegicus (rat)
Description:
P61169
Residue:
444
  
Inhibitor
Name:
BDBM50010724
Synonyms:
CHEMBL305916 | N-(1-Ethyl-pyrrolidin-2-ylmethyl)-6-hydroxy-2,3-dimethoxy-benzamide
Type:
Small organic molecule
Emp. Form.:
C16H24N2O4
Mol. Mass.:
308.3728
SMILES:
CCN1CCC[C@H]1CNC(=O)c1c(O)ccc(OC)c1OC
: