Target
Atrial natriuretic peptide receptor 1
Ligand
BDBM50262433
Substrate
Meas. Tech.
ChEBML_1696823
EC50
7900±n/a nM
Citation
 Iwaki, TNakamura, YTanaka, TOgawa, YIwamoto, OOkamura, YKawase, YFuruya, MOyama, YNagayama, T Discovery and SAR of a novel series of Natriuretic Peptide Receptor-A (NPR-A) agonists. Bioorg Med Chem Lett 27:4904-4907 (2017)  
Target
Name:
Atrial natriuretic peptide receptor 1
Synonyms:
ANP-A ANPRA_HUMAN Atrial natriuretic peptide receptor GC-A NPR-A | NPR1
Type:
PROTEIN
Mol. Mass.:
118919.35
Organism:
Homo sapiens (Human)
Description:
ChEMBL_700223
Residue:
1061
  
Inhibitor
Name:
BDBM50262433
Synonyms:
CHEMBL4093257
Type:
Small organic molecule
Emp. Form.:
C21H21N5S
Mol. Mass.:
375.49
SMILES:
CC(C)Nc1nc(NCc2cccnc2)c2sc(cc2n1)-c1ccccc1
: