Target
Atrial natriuretic peptide receptor 1
Ligand
BDBM50262457
Substrate
Meas. Tech.
ChEBML_1696823
EC50
1500±n/a nM
Citation
 Iwaki, TNakamura, YTanaka, TOgawa, YIwamoto, OOkamura, YKawase, YFuruya, MOyama, YNagayama, T Discovery and SAR of a novel series of Natriuretic Peptide Receptor-A (NPR-A) agonists. Bioorg Med Chem Lett 27:4904-4907 (2017)  
Target
Name:
Atrial natriuretic peptide receptor 1
Synonyms:
ANP-A ANPRA_HUMAN Atrial natriuretic peptide receptor GC-A NPR-A | NPR1
Type:
PROTEIN
Mol. Mass.:
118919.35
Organism:
Homo sapiens (Human)
Description:
ChEMBL_700223
Residue:
1061
  
Inhibitor
Name:
BDBM50262457
Synonyms:
CHEMBL4101571
Type:
Small organic molecule
Emp. Form.:
C31H36N6O
Mol. Mass.:
508.6571
SMILES:
CC(C)Nc1nc(NCc2ccc(NC(=O)C3CCCN(C)C3)cc2)c2cc(ccc2n1)-c1ccccc1
: