Target
Kelch-like ECH-associated protein 1
Ligand
BDBM50262958
Substrate
Meas. Tech.
ChEBML_1697237
IC50
260±n/a nM
Citation
 Yasuda, DYuasa, AObata, RNakajima, MTakahashi, KOhe, TIchimura, YKomatsu, MYamamoto, MImamura, RKojima, HOkabe, TNagano, TMashino, T Discovery of benzo[g]indoles as a novel class of non-covalent Keap1-Nrf2 protein-protein interaction inhibitor. Bioorg Med Chem Lett 27:5006-5009 (2017)  
Target
Name:
Kelch-like ECH-associated protein 1
Synonyms:
Cytosolic inhibitor of Nrf2 KEAP1 KEAP1_HUMAN KLHL19 | Kelch-like protein 19
Type:
PROTEIN
Mol. Mass.:
69664.53
Organism:
Homo sapiens (Human)
Description:
ChEMBL_107924
Residue:
624
  
Inhibitor
Name:
BDBM50262958
Synonyms:
CHEMBL4070735
Type:
Small organic molecule
Emp. Form.:
C34H29N5O9S2
Mol. Mass.:
715.752
SMILES:
COc1ccc(cc1)S(=O)(=O)Nc1cc2c(C(=O)NNc3ccc(cc3)[N+]([O-])=O)c(C)n(c2c2ccccc12)S(=O)(=O)c1ccc(OC)cc1
: