Target
Adenosine receptor A2b
Ligand
BDBM50263179
Substrate
Meas. Tech.
ChEBML_1697703
EC50
60±n/a nM
Citation
 Aurelio, LBaltos, JAFord, LNguyen, ATNJörg, MDevine, SMValant, CWhite, PJChristopoulos, AMay, LTScammells, PJ A Structure-Activity Relationship Study of Bitopic N J Med Chem 61:2087-2103 (2018)  
Target
Name:
Adenosine receptor A2b
Synonyms:
AA2BR_HUMAN ADORA2B Adenosine receptors A2b | Adenosine receptors; A2a & A2b
Type:
G Protein-Coupled Receptor (GPCR)
Mol. Mass.:
36341.22
Organism:
Homo sapiens (Human)
Description:
Residue:
332
  
Inhibitor
Name:
BDBM50263179
Synonyms:
CHEMBL4096796
Type:
Small organic molecule
Emp. Form.:
C27H33N7O5S
Mol. Mass.:
567.66
SMILES:
Nc1ccc(s1)-c1cccc(c1)C(=O)NCCCCCCNc1ncnc2n(cnc12)[C@@H]1O[C@H](CO)[C@@H](O)[C@H]1O
: