Target
Adenosine receptor A2b
Ligand
BDBM50263207
Substrate
Meas. Tech.
ChEBML_1697703
EC50
18±n/a nM
Citation
 Aurelio, LBaltos, JAFord, LNguyen, ATNJörg, MDevine, SMValant, CWhite, PJChristopoulos, AMay, LTScammells, PJ A Structure-Activity Relationship Study of Bitopic N J Med Chem 61:2087-2103 (2018)  
Target
Name:
Adenosine receptor A2b
Synonyms:
AA2BR_HUMAN ADORA2B Adenosine receptors A2b | Adenosine receptors; A2a & A2b
Type:
G Protein-Coupled Receptor (GPCR)
Mol. Mass.:
36341.22
Organism:
Homo sapiens (Human)
Description:
Residue:
332
  
Inhibitor
Name:
BDBM50263207
Synonyms:
CHEMBL4086624
Type:
Small organic molecule
Emp. Form.:
C27H32N6O5S
Mol. Mass.:
552.645
SMILES:
OC[C@H]1O[C@H]([C@H](O)[C@@H]1O)n1cnc2c(NCCCCCCNC(=O)c3cccc(c3)-c3cccs3)ncnc12
: