Target
Polyunsaturated fatty acid 5-lipoxygenase
Ligand
BDBM50010961
Substrate
Meas. Tech.
ChEMBL_163797 (CHEMBL772970)
IC50
82.0±n/a nM
Citation
 Ohkawa, STerao, STerashita, ZShibouta, YNishikawa, K Dual inhibitors of thromboxane A2 synthase and 5-lipoxygenase with scavenging activity of active oxygen species. Synthesis of a novel series of (3-pyridylmethyl)benzoquinone derivatives. J Med Chem 34:267-76 (1991)  
Target
Name:
Polyunsaturated fatty acid 5-lipoxygenase
Synonyms:
Alox5 LOX5_RAT
Type:
PROTEIN
Mol. Mass.:
78082.31
Organism:
Rattus norvegicus
Description:
ChEMBL_1432947
Residue:
673
  
Inhibitor
Name:
BDBM50010961
Synonyms:
2-Methyl-3-pyridin-3-ylmethyl-[1,4]naphthoquinone | CHEMBL92863
Type:
Small organic molecule
Emp. Form.:
C17H13NO2
Mol. Mass.:
263.2906
SMILES:
CC1=C(Cc2cccnc2)C(=O)c2ccccc2C1=O
: