Target
Polyunsaturated fatty acid 5-lipoxygenase
Ligand
BDBM50010967
Substrate
Meas. Tech.
ChEMBL_163797 (CHEMBL772970)
IC50
87000.0±n/a nM
Citation
 Ohkawa, STerao, STerashita, ZShibouta, YNishikawa, K Dual inhibitors of thromboxane A2 synthase and 5-lipoxygenase with scavenging activity of active oxygen species. Synthesis of a novel series of (3-pyridylmethyl)benzoquinone derivatives. J Med Chem 34:267-76 (1991)  
Target
Name:
Polyunsaturated fatty acid 5-lipoxygenase
Synonyms:
Alox5 LOX5_RAT
Type:
PROTEIN
Mol. Mass.:
78082.31
Organism:
Rattus norvegicus
Description:
ChEMBL_1432947
Residue:
673
  
Inhibitor
Name:
BDBM50010967
Synonyms:
3-{3-[Pyridin-3-yl-(2,4,5-trimethyl-3,6-dioxo-cyclohexa-1,4-dienyl)-methyl]-phenyl}-acrylic acid | CHEMBL93150
Type:
Small organic molecule
Emp. Form.:
C24H21NO4
Mol. Mass.:
387.4278
SMILES:
Cc1c(O)c(=C(c2cccnc2)c2cccc(C=CC(O)=O)c2)c(C)c(O)c1=C
: