Target
MAP kinase-interacting serine/threonine-protein kinase 2
Ligand
BDBM168222
Substrate
Meas. Tech.
ChEBML_1697750
IC50
1.2±n/a nM
Citation
 Reich, SHSprengeler, PAChiang, GGAppleman, JRChen, JClarine, JEam, BErnst, JTHan, QGoel, VKHan, EZRHuang, VHung, INJJemison, AJessen, KAMolter, JMurphy, DNeal, MParker, GSShaghafi, MSperry, SStaunton, JStumpf, CRThompson, PATran, CWebber, SEWegerski, CJZheng, HWebster, KR Structure-based Design of Pyridone-Aminal eFT508 Targeting Dysregulated Translation by Selective Mitogen-activated Protein Kinase Interacting Kinases 1 and 2 (MNK1/2) Inhibition. J Med Chem 61:3516-3540 (2018)  
Target
Name:
MAP kinase-interacting serine/threonine-protein kinase 2
Synonyms:
GPRK7 MAP kinase-interacting serine/threonine-protein kinase 2 (MKNK2) MAP-kinase interacting kinase 2 (MNK2) MKNK2_HUMAN | MNK2
Type:
Protein
Mol. Mass.:
51870.79
Organism:
Homo sapiens (Human)
Description:
Q9HBH9
Residue:
465
  
Inhibitor
Name:
BDBM168222
Synonyms:
US9669031, 51 N-[6-[[8-chloro-3-(3-chlorophenyl)-3-methyl-1,5-dioxo-2H-imidazo[1,5-a]pyridin-6-yl]amino]pyrimidin-4-yl]cyclopropanecarboxamide (Cpd. No. 51) | US9669031, 93 6-[(6-aminopyrimidin-4-yl)amino]-8-chloro-3-(3-chlorophenyl)-3-methyl-2H-imidazo[1,5-a]pyridine-1,5-dione (Cpd. No. 93)
Type:
Small organic molecule
Emp. Form.:
C22H18Cl2N6O3
Mol. Mass.:
485.323
SMILES:
CC1(NC(=O)c2c(Cl)cc(Nc3cc(NC(=O)C4CC4)ncn3)c(=O)n12)c1cccc(Cl)c1
: