Target
Broad substrate specificity ATP-binding cassette transporter ABCG2
Ligand
BDBM50263366
Substrate
Meas. Tech.
ChEMBL_1697856 (CHEMBL4048746)
EC50
270±n/a nM
Citation
 Krapf, MKGallus, JVahdati, SWiese, M New Inhibitors of Breast Cancer Resistance Protein (ABCG2) Containing a 2,4-Disubstituted Pyridopyrimidine Scaffold. J Med Chem 61:3389-3408 (2018)  
Target
Name:
Broad substrate specificity ATP-binding cassette transporter ABCG2
Synonyms:
ABCG2 ABCP ATP-binding cassette sub-family G member 2 ATP-binding cassette, sub-family G, member 2 BCRP1 CDw338 Mitoxantrone resistance-associated protein Urate exporter
Type:
Multi-pass membrane protein; monomer or homodimer; disulfide-linked
Mol. Mass.:
72329.48
Organism:
Homo sapiens (Human)
Description:
Q9UNQ0
Residue:
655
  
Inhibitor
Name:
BDBM50263366
Synonyms:
CHEMBL4066611
Type:
Small organic molecule
Emp. Form.:
C20H13N5
Mol. Mass.:
323.3507
SMILES:
N#Cc1ccc(Nc2nc(nc3ncccc23)-c2ccccc2)cc1
: