Target
3-hydroxy-3-methylglutaryl-coenzyme A reductase
Ligand
BDBM50011019
Substrate
Meas. Tech.
ChEBML_80648
IC50
347±n/a nM
Citation
 Roth, BDBlankley, CJChucholowski, AWFerguson, EHoefle, MLOrtwine, DFNewton, RSSekerke, CSSliskovic, DRStratton, CD Inhibitors of cholesterol biosynthesis. 3. Tetrahydro-4-hydroxy-6-[2-(1H-pyrrol-1-yl)ethyl]-2H-pyran-2-one inhibitors of HMG-CoA reductase. 2. Effects of introducing substituents at positions three and four of the pyrrole nucleus. J Med Chem 34:357-66 (1991)  
Target
Name:
3-hydroxy-3-methylglutaryl-coenzyme A reductase
Synonyms:
HMDH_RAT Hmgcr
Type:
Enzyme
Mol. Mass.:
96689.85
Organism:
Rattus norvegicus (rat)
Description:
Isolated rat liver microsomes were used as enzyme source.
Residue:
887
  
Inhibitor
Name:
BDBM50011019
Synonyms:
6-{2-[2-(4-Fluoro-phenyl)-5-isopropyl-3-phenyl-pyrrol-1-yl]-ethyl}-4-hydroxy-tetrahydro-pyran-2-one | CHEMBL333478
Type:
Small organic molecule
Emp. Form.:
C26H28FNO3
Mol. Mass.:
421.5038
SMILES:
CC(C)c1cc(c(-c2ccc(F)cc2)n1CC[C@@H]1C[C@@H](O)CC(=O)O1)-c1ccccc1
: