Target
Angiotensin-converting enzyme
Ligand
BDBM50011194
Substrate
Meas. Tech.
ChEBML_35216
IC50
1.5±n/a nM
Citation
 Bennion, CBrown, RCCook, ARManners, CNPayling, DWRobinson, DH Design, synthesis, and physicochemical properties of a novel, conformationally restricted 2,3-dihydro-1,3,4-thiadiazole-containing angiotensin converting enzyme inhibitor which is preferentially eliminated by the biliary route in rats. J Med Chem 34:439-47 (1991)  
Target
Name:
Angiotensin-converting enzyme
Synonyms:
ACE_RAT Angiotensin-converting enzyme | Dcp1
Type:
PROTEIN
Mol. Mass.:
150907.81
Organism:
Rattus norvegicus
Description:
ChEMBL_35219
Residue:
1313
  
Inhibitor
Name:
BDBM50011194
Synonyms:
3-[2-(1-Carboxy-3-phenyl-propylamino)-propionyl]-5-phenyl-2,3-dihydro-[1,3,4]thiadiazole-2-carboxylic acid | CHEMBL423916
Type:
Small organic molecule
Emp. Form.:
C22H23N3O5S
Mol. Mass.:
441.5
SMILES:
C[C@H](N[C@@H](CCc1ccccc1)C(O)=O)C(=O)N1N=C(S[C@H]1C(O)=O)c1ccccc1
: