Target
Mu-type opioid receptor
Ligand
BDBM50264564
Substrate
Meas. Tech.
ChEMBL_1698853 (CHEMBL4049835)
Ki
32±n/a nM
Citation
 Wang, JSong, QXu, ABao, YXu, YZhu, Q Design, synthesis and biological evaluation of aminobenzyloxyarylamide derivatives as selective? opioid receptor antagonists. Eur J Med Chem 130:15-25 (2017)  
Target
Name:
Mu-type opioid receptor
Synonyms:
M-OR-1 MOR-1 MUOR1 Mu opiate receptor OPRM1 hMOP | mu-type opioid receptor isoform MOR-1
Type:
G Protein-Coupled Receptor (GPCR)
Mol. Mass.:
44789.51
Organism:
Homo sapiens (Human)
Description:
P35372
Residue:
400
  
Inhibitor
Name:
BDBM50264564
Synonyms:
CHEMBL4082214
Type:
Small organic molecule
Emp. Form.:
C26H27ClN2O2
Mol. Mass.:
434.958
SMILES:
Cc1cc(C)cc(c1)C1CCCN1Cc1ccc(Oc2ccc(cc2)C(N)=O)c(Cl)c1
: